{"text_format":"1","workbook":"xlsx","n_sheets":11,"sheets":["Inhalt","Vorbemerkungen","Pfarrpersonen","A&V_Verk.&GD","A&V_Diak.&Seels.","A&V_Bild.&Spirit.","A&V_Aufb.&Leit.","A&V_W.Dienste","Stellenbeschrieb Einzelperson","Grafik Gesamtpensum","Gesetzestexte"],"not_rendered":{"charts":1,"images":3,"macros":1,"external_links":0,"defined_names":27,"comments":0,"pivot_tables":1},"unopened":[],"bounds":{"document_bytes":16777216,"sheet_cells":100000,"rows_first":2000,"rows_last":500,"rows_between":2000,"halvings":0,"cell_chars":16384,"cell_head_chars":4096},"cells_cut":0,"cells_raw":0,"read":"whole","date_system":"1900"}

{"sheet":"Inhalt","index":0,"n_rows":34,"n_cols":2,"rows_kept":34,"cut":false,"hidden":false,"merged":[[26,1,26,2]]}
[]
[]
[]
[]
[]
[null,"Leitfaden und Formular"]
[]
[null,"Planungshilfe zur"]
[null,"Pfarrdienstordnung"]
[]
[]
[null,"Vorbemerkungen"]
[]
[null,"Übersicht Pfarrpersonen und Pfarrstellenprozente "]
[]
[null,"Pfarramtliche Aufgaben- und Verantwortungsbereiche nach Handlungsfeldern (A&V)"]
[null," - Verkündigung und Gottesdienst (A&V_Verk.&GD)"]
[null," - Diakonie und Seelsorge (A&V_Diak.&Seels.)"]
[null," - Bildung und Spiritualität (A&V_Bild.&Spirit.)"]
[null," - Gemeindeaufbau und Leitung (A&V_Aufb.&Leit.)"]
{"$rows_left_out":15}
{"sheet":"Vorbemerkungen","index":1,"n_rows":0,"n_cols":0,"rows_kept":0,"cut":false,"hidden":false,"merged":[]}

{"sheet":"Pfarrpersonen","index":2,"n_rows":61,"n_cols":11,"rows_kept":61,"cut":false,"hidden":false,"merged":[[18,1,18,2],[17,1,17,2],[6,1,6,2],[7,1,7,2],[8,1,8,2],[19,1,19,2],[20,1,20,2],[21,1,21,2],[22,1,22,2],[22,11,22,13]]}
[]
[]
[null,null,null,null,null,null,null,"Anzahl Gemeinde-mitglieder","Stellenprozente Gesamtgemeinde \n(2000 Gemeindemitglieder = 100% Stelle; ab 2000 Mitglieder jeweils \n5 Stellenprozente zusätzlich pro 825 Mitglieder)"]
["Übersicht Pfarrpersonen und Pfarrstellenprozente",null,null,null,null,null,null,null,{"$f":"IF(H4>2000,H4/2000+(ROUNDUP(H4/825,0)*5/100),H4/2000)","v":0}]
[]
[]
["Kürzel","Name",null,"Vorname","AHV-Nummer","Alter","Beschäftigungsgrad in Stellenprozenten","Zur Verfügung stehende Arbeitstage","Status \n(Stellvertretung, Projektstelle, \ngemeindeeigene Stelle, etc.)","In der KG seit","Datum der Wahl"]
["Gesamtpensum",null,null,null,null,null,{"$f":"G23","v":0},{"$f":"H23","v":0}]
["Delta",null,null,null,null,null,null,{"$f":"IF(F9>59,(($B$33-(5.5-0.75))*G9),$B$33*G9)","v":0}]
[null,null,null,null,null,null,null,{"$f":"IF(F10>59,(($B$33-(5.5-0.75))*G10),$B$33*G10)","v":0}]
[null,null,null,null,null,null,null,0]
[null,null,null,null,null,null,null,0]
[null,null,null,null,null,null,null,0]
[null,null,null,null,null,null,null,0]
[null,null,null,null,null,null,null,0]
[null,null,null,null,null,null,null,0]
[null,null,null,null,null,null,null,0]
[null,null,null,null,null,null,null,0]
[null,null,null,null,null,null,null,0]
[null,null,null,null,null,null,null,0]
{"$rows_left_out":42}
{"sheet":"A&V_Verk.&GD","index":3,"n_rows":194,"n_cols":11,"rows_kept":194,"cut":false,"hidden":false,"merged":[[11,2,13,5],[2,2,2,9],[5,5,5,9],[8,5,8,9],[7,5,7,9],[9,2,9,9],[10,2,10,5],[10,6,10,9],[11,6,11,9],[6,5,6,9],[1,10,4,10],[1,11,4,11],[16,6,16,7],[34,6,34,7],[12,6,12,9],[13,6,13,9],[88,6,88,7],[106,6,106,7],[142,6,142,7],[124,6,124,7],[52,6,52,7],[178,6,178,7],[16,3,16,5],[34,3,34,5],[52,3,52,5],[70,3,70,5],[88,3,88,5],[106,3,106,5],[124,3,124,5],[142,3,142,5],[160,3,160,5],[178,3,178,5],[69,3,69,5],[51,3,51,5],[87,3,87,5],[105,3,105,5],[70,6,70,7],[123,3,123,5],[141,3,141,5],[159,3,159,5],[177,3,177,5],[160,6,160,7]]}
[null,null,"Pfarramtliche Aufgaben- und Verantwortungsbereiche im Handlungsfeld Verkündigung und Gottesdienst"]
[]
[]
[]
[]
[]
[]
[]
[]
[]
[]
[]
[]
[]
[]
[null,null,"Pfarrpersonen",{"$f":"Pfarrpersonen!A8","v":"Gesamtpensum"}]
[{"$f":"CONCATENATE($D$16,B17)","v":"GesamtpensumGD0"},"GD0","Arbeitsbereich Gottesdienst / Kasualien","Anzahl Anlässe pro Jahr",null,null,"Zeitbedarf in AT pro zugeteilte Grösse ",null,"Summe Zeitbedarf in AT","Bemerkung (Hauptverantwortung, Planung, konzeptioneller Ansatz)","Erklärungen zu den Berechnung / Kalkulations-Faktoren "]
[null,null,null,"Ist","Änderung","Soll","Ausgangs-wert","eigener Faktor",{"$f":"SUM(I19:I32)","v":0}]
[{"$f":"CONCATENATE($D$16,B19)","v":"GesamtpensumGD1"},"GD1","Predigtgottesdienste",null,null,{"$f":"D19+E19","v":0},1.2,null,{"$f":"F19*IF(ISBLANK(H19),G19,H19)","v":0},null,"Durchschnittlicher Aufwand  1.2 AT pro GD"]
["GesamtpensumGD2","GD2","Festtagsgottesdienste",null,null,0,1.5,null,{"$f":"F20*IF(ISBLANK(H20),G20,H20)","v":0},null,"Durchschnittlicher Aufwand  1 .5 AT pro GD"]
{"$rows_left_out":175}
{"sheet":"A&V_Diak.&Seels.","index":4,"n_rows":437,"n_cols":11,"rows_kept":437,"cut":false,"hidden":false,"merged":[[100,6,100,7],[114,6,114,7],[72,6,72,7],[86,6,86,7],[275,6,275,7],[262,6,262,7],[249,6,249,7],[236,6,236,7],[223,6,223,7],[424,6,424,7],[409,6,409,7],[394,6,394,7],[379,6,379,7],[349,6,349,7],[364,6,364,7],[334,6,334,7],[319,6,319,7],[6,5,6,9],[1,10,4,10],[304,6,304,7],[16,6,16,7],[30,6,30,7],[158,6,158,7],[171,6,171,7],[289,6,289,7],[2,2,2,9],[5,5,5,9],[7,5,7,9],[8,5,8,9],[11,5,11,9],[12,5,12,9],[236,3,236,5],[9,2,9,9],[10,5,10,9],[13,5,13,9],[158,3,158,5],[171,3,171,5],[127,3,127,5],[141,3,141,5],[142,3,142,5],[44,6,44,7],[58,6,58,7],[210,6,210,7],[197,6,197,7],[184,6,184,7],[142,6,142,7],[128,6,128,7],[86,3,86,5],[100,3,100,5],[114,3,114,5],[128,3,128,5],[43,3,43,5],[57,3,57,5],[71,3,71,5],[85,3,85,5],[99,3,99,5],[113,3,113,5],[16,3,16,5],[30,3,30,5],[44,3,44,5],[58,3,58,5],[72,3,72,5],[424,3,424,5],[262,3,262,5],[275,3,275,5],[289,3,289,5],[304,3,304,5],[319,3,319,5],[393,3,393,5],[408,3,408,5],[423,3,423,5],[183,3,183,5],[196,3,196,5],[209,3,209,5],[222,3,222,5],[235,3,235,5],[184,3,184,5],[197,3,197,5],[210,3,210,5],[223,3,223,5],[248,3,248,5],[261,3,261,5],[274,3,274,5],[394,3,394,5],[409,3,409,5],[334,3,334,5],[349,3,349,5],[364,3,364,5],[379,3,379,5],[318,3,318,5],[333,3,333,5],[348,3,348,5],[363,3,363,5],[378,3,378,5],[249,3,249,5]]}
[null,null,"Pfarramtliche Aufgaben- und Verantwortungsbereiche im Handlungsfeld Diakonie und Seelsorge"]
[]
[]
[]
[]
[]
[]
[]
[]
[]
[]
[]
[]
[]
[null,null,"Seelsorge "]
[null,null,"Pfarrpersonen",{"$f":"Pfarrpersonen!A8","v":"Gesamtpensum"}]
[{"$f":"CONCATENATE($D$16,B17)","v":"GesamtpensumSEE0"},"SEE0","Arbeitsbereich Seelsorge","Anzahl Anlässe pro Jahr",null,null,"Zeitbedarf in AT pro zugeteilte Grösse ",null,"Summe Zeitbedarf in AT","Bemerkung (Hauptverantwortung, Planung, konzeptioneller Ansatz)","Erklärungen zu den Berechnung / Kalkulations-Faktoren "]
[null,null,null,"Ist","Änderung","Soll","Ausgangs-wert","eigener Faktor",{"$f":"SUM(I19:I28)","v":0}]
[{"$f":"CONCATENATE($D$16,B19)","v":"GesamtpensumSEE1"},"SEE1","Seelsorge in der Gemeinde \n(Anzahl zugewandte Mitglieder)",null,null,{"$f":"D19+E19","v":0},{"$f":"0.1/8.73","v":1.1454753722794961E-2},null,{"$f":"F19*IF(ISBLANK(H19),G19,H19)","v":0},null,"Eingabe: Anzahl zugewandter Gemeindemitglieder, \nFaktor: durchschn. 0.01 AT pro Mitglied pro Jahr  bzw. 0.5AT pro Woche \nin einem 100% Pensum "]
["GesamtpensumSEE2","SEE2","Betreuung von Gruppen \n(AZ Gruppen)",null,null,0,1,null,0,null,"Eingabe: Anzahl Gruppen, Faktor: 1 AT pro Gruppe pro Jahr"]
{"$rows_left_out":418}
{"sheet":"A&V_Bild.&Spirit.","index":5,"n_rows":320,"n_cols":11,"rows_kept":320,"cut":false,"hidden":false,"merged":[[252,6,252,7],[238,6,238,7],[280,6,280,7],[266,6,266,7],[308,6,308,7],[294,6,294,7],[224,6,224,7],[210,6,210,7],[182,6,182,7],[160,6,160,7],[196,6,196,7],[144,6,144,7],[128,6,128,7],[80,6,80,7],[96,6,96,7],[112,6,112,7],[64,6,64,7],[48,6,48,7],[1,10,4,10],[6,5,6,9],[16,6,16,7],[2,2,2,9],[5,5,5,9],[7,5,7,9],[8,5,8,9],[32,6,32,7],[10,5,10,9],[9,2,9,9],[11,5,11,9],[12,5,12,9],[13,5,13,9],[16,3,16,5],[32,3,32,5],[48,3,48,5],[64,3,64,5],[80,3,80,5],[96,3,96,5],[238,3,238,5],[252,3,252,5],[112,3,112,5],[128,3,128,5],[144,3,144,5],[160,3,160,5],[182,3,182,5],[308,3,308,5],[47,3,47,5],[63,3,63,5],[79,3,79,5],[95,3,95,5],[111,3,111,5],[127,3,127,5],[143,3,143,5],[159,3,159,5],[209,3,209,5],[223,3,223,5],[237,3,237,5],[251,3,251,5],[196,3,196,5],[210,3,210,5],[224,3,224,5],[265,3,265,5],[279,3,279,5],[293,3,293,5],[307,3,307,5],[266,3,266,5],[280,3,280,5],[294,3,294,5]]}
[null,null,"Pfarramtliche Aufgaben- und Verantwortungsbereiche im Handlungsfeld Bildung und Spiritualität"]
[]
[]
[]
[]
[]
[]
[]
[]
[]
[]
[]
[]
[]
[]
[null,null,"Pfarrpersonen",{"$f":"Pfarrpersonen!A8","v":"Gesamtpensum"}]
[{"$f":"CONCATENATE($D$16,B17)","v":"GesamtpensumK0"},"K0","Arbeitsbereich Konfirmandenarbeit und rpg","Anzahl ",null,null,"Zeitbedarf in AT pro zugeteilte Grösse ",null,"Summe Zeitbedarf in AT","Bemerkung (Hauptverantwortung, Planung, konzeptioneller Ansatz)","Erklärungen zu den Berechnung / Kalkulations-Faktoren "]
[null,null,null,"Ist","Änderung","Soll","Ausgangs- wert","eigener Faktor",{"$f":"SUM(I19:I30)","v":0}]
[{"$f":"CONCATENATE($D$16,B19)","v":"GesamtpensumK1"},"K1","Konfirmandenunterricht (AZ Lektionen)",null,null,{"$f":"D19+E19","v":0},{"$f":"2/8.73","v":0.22909507445589919},null,{"$f":"F19*IF(ISBLANK(H19),G19,H19)","v":0},null,"Eingabe: Anzahl Lektionen pro Jahr à 60 Min., \nFaktor: 2 h pro 60 Min.-Lektion "]
["GesamtpensumK2","K2","Juki-Lektionen",null,null,0,{"$f":"2/8.73","v":0.22909507445589919},null,0,null,"Eingabe: Anzahl Lektionen pro Jahr à 60 Min., \nFaktor: 2 h pro 60 Min.-Lektion "]
{"$rows_left_out":301}
{"sheet":"A&V_Aufb.&Leit.","index":6,"n_rows":336,"n_cols":11,"rows_kept":336,"cut":false,"hidden":false,"merged":[[303,6,303,7],[289,6,289,7],[275,6,275,7],[261,6,261,7],[247,6,247,7],[9,2,9,9],[233,6,233,7],[219,6,219,7],[205,6,205,7],[191,6,191,7],[177,6,177,7],[32,6,32,7],[16,6,16,7],[10,5,10,9],[11,5,11,9],[12,5,12,9],[13,5,13,9],[16,3,16,5],[32,3,32,5],[64,6,64,7],[48,6,48,7],[1,10,4,10],[2,2,2,9],[5,5,5,9],[7,5,7,9],[8,5,8,9],[6,5,6,9],[80,6,80,7],[112,6,112,7],[96,6,96,7],[128,6,128,7],[144,6,144,7],[160,3,160,5],[177,3,177,5],[160,6,160,7],[191,3,191,5],[205,3,205,5],[289,3,289,5],[303,3,303,5],[204,3,204,5],[218,3,218,5],[232,3,232,5],[246,3,246,5],[260,3,260,5],[274,3,274,5],[288,3,288,5],[302,3,302,5],[219,3,219,5],[233,3,233,5],[247,3,247,5],[261,3,261,5],[275,3,275,5],[47,3,47,5],[63,3,63,5],[79,3,79,5],[95,3,95,5],[111,3,111,5],[127,3,127,5],[143,3,143,5],[159,3,159,5],[48,3,48,5],[64,3,64,5],[80,3,80,5],[96,3,96,5],[112,3,112,5],[128,3,128,5],[144,3,144,5]]}
[null,null,"Pfarramtliche Aufgaben- und Verantwortungsbereiche im Handlungsfeld Gemeindeaufbau und Leitung"]
[]
[]
[]
[]
[]
[]
[]
[]
[]
[]
[]
[]
[]
[null,null,"Gemeindeleitung"]
[null,null,"Pfarrpersonen",{"$f":"Pfarrpersonen!A8","v":"Gesamtpensum"}]
[{"$f":"CONCATENATE($D$16,B17)","v":"GesamtpensumG0"},"G0","Arbeitsbereich Gemeindeleitung","Anzahl Sitzungen",null,null,"Zeitbedarf in AT pro zugeteilte Grösse ",null,"Summe Zeitbedarf in AT","Bemerkung (Hauptverantwortung, Planung, konzeptioneller Ansatz)","Erklärungen zu den Berechnung / Kalkulations-Faktoren "]
[null,null,null,"Ist","Änderung","Soll","Ausgangs- wert","eigener Faktor",{"$f":"SUM(I19:I30)","v":0}]
[{"$f":"CONCATENATE($D$16,B19)","v":"GesamtpensumG1"},"G1","Sitzungen Pfarrkonvent",null,null,{"$f":"D19+E19","v":0},{"$f":"2/8.73","v":0.22909507445589919},null,{"$f":"F19*IF(ISBLANK(H19),G19,H19)","v":0},null,"Eingabe: Anzahl Sitzungen pro Jahr, Faktor: 2 h pro Sitzung"]
["GesamtpensumG2","G2","Leitung Pfarrkonvent (in AT)",null,null,0,{"$f":"1","v":1},null,0,null,"Geschätzter Aufwand in Tagen pro Jahr"]
{"$rows_left_out":317}
{"sheet":"A&V_W.Dienste","index":7,"n_rows":154,"n_cols":11,"rows_kept":154,"cut":false,"hidden":false,"merged":[[142,3,142,5],[30,3,30,5],[44,3,44,5],[58,3,58,5],[72,3,72,5],[43,3,43,5],[57,3,57,5],[71,3,71,5],[86,3,86,5],[100,3,100,5],[85,3,85,5],[99,3,99,5],[113,3,113,5],[127,3,127,5],[141,3,141,5],[128,3,128,5],[142,6,142,7],[114,6,114,7],[44,6,44,7],[1,10,4,10],[30,6,30,7],[9,5,9,9],[2,2,2,9],[6,5,6,9],[7,5,7,9],[8,2,8,9],[10,5,10,9],[11,5,11,9],[12,5,12,9],[16,6,16,7],[16,3,16,5],[114,3,114,5],[128,6,128,7],[100,6,100,7],[58,6,58,7],[86,6,86,7],[72,6,72,7]]}
[null,null,"Pfarramtliche Aufgaben- und Verantwortungsbereiche im Zusammenhang mit weiteren Diensten"]
[]
[]
[]
[]
[]
[]
[]
[]
[]
[]
[]
[]
[]
[]
[null,null,"Pfarrpersonen",{"$f":"Pfarrpersonen!A8","v":"Gesamtpensum"}]
[{"$f":"CONCATENATE($D$16,B17)","v":"GesamtpensumWD0"},"WD0","Arbeitsbereich Weitere Dienste","Anzahl ",null,null,"Zeitbedarf in AT pro zugeteilte Grösse ",null,"Summe Zeitbedarf in AT","Bemerkung (Hauptverantwortung, Planung, konzeptioneller Ansatz)","Erklärungen zu den Berechnung / Kalkulations-Faktoren "]
[null,null,null,"Ist","Änderung","Soll","Ausgangs- wert","eigener Faktor",{"$f":"SUM(I19:I28)","v":0}]
[{"$f":"CONCATENATE($D$16,B19)","v":"GesamtpensumWD1"},"WD1","Armeeseelsorge",null,null,{"$f":"D19+E19","v":0},null,null,{"$f":"F19*IF(ISBLANK(H19),G19,H19)","v":0},null,"Anzahl Tage pro Jahr"]
["GesamtpensumWD2","WD2","Militär- / Bevölkerungsschutzdienst",null,null,{"$f":"D20+E20","v":0},null,null,0,null,"Anzahl Tage pro Jahr"]
{"$rows_left_out":135}
{"sheet":"Stellenbeschrieb Einzelperson","index":8,"n_rows":145,"n_cols":7,"rows_kept":145,"cut":false,"hidden":false,"merged":[[5,2,5,3],[137,1,142,6],[137,7,142,7],[123,3,123,4],[95,3,95,4],[82,3,82,4],[67,3,67,4],[53,3,53,4],[41,3,41,4],[28,3,28,4],[11,3,11,4],[110,3,110,4]]}
[null,null,"a"]
[null,null,"a"]
[null,null,"a"]
[null,"Pfarramtlicher Aufgaben- und Verantwortungsbereichsbericht"]
[null,null,"a"]
[null,"Pfarrperson: ",null,null,null,{"$f":"IF(ISERROR(VLOOKUP(#REF!,Pfarrpersonen!$A$7:$H$22,4,FALSE)),\"\",VLOOKUP(#REF!,Pfarrpersonen!$A$7:$H$22,4,FALSE))","v":""},{"$f":"IF(ISERROR(VLOOKUP(C6,Pfarrpersonen!$A$7:$H$22,2,FALSE)),\"\",VLOOKUP(C6,Pfarrpersonen!$A$7:$H$22,2,FALSE))","v":""}]
[null,"Pensum: ","a",null,null,{"$f":"IF(ISERROR(VLOOKUP(C6,Pfarrpersonen!$A$7:$H$22,7,FALSE)),\"\",VLOOKUP(C6,Pfarrpersonen!$A$7:$H$22,7,FALSE))","v":""}]
[null,"Zur Verfügung stehende Arbeitszeit:","a",null,null,{"$f":"IF(ISERROR(VLOOKUP(C6,Pfarrpersonen!$A$7:$H$22,8,FALSE)),\"\",VLOOKUP(C6,Pfarrpersonen!$A$7:$H$22,8,FALSE))","v":""},"Arbeitstage"]
[null,"Verplante Arbeitszeit:","a",null,null,{"$f":"SUM(F14:F135)","v":0},"Arbeitstage"]
[null,"Verplantes Pensum:",null,null,null,{"$f":"F9/Pfarrpersonen!B33","v":0}]
[null,null,"a"]
[{"$f":"CONCATENATE($C$6,'A&V_Verk.&GD'!B17)","v":"GD0"},{"$f":"'A&V_Verk.&GD'!C17","v":"Arbeitsbereich Gottesdienst / Kasualien"},{"$f":"'A&V_Verk.&GD'!D17","v":"Anzahl Anlässe pro Jahr"},"Zeitbedarf in AT pro zugeteilte Grösse ",null,{"$f":"'A&V_Verk.&GD'!I17","v":"Summe Zeitbedarf in AT"},{"$f":"'A&V_Verk.&GD'!J17","v":"Bemerkung (Hauptverantwortung, Planung, konzeptioneller Ansatz)"}]
[null,null,"a","Ausgangs- wert","eigener Faktor"]
[{"$f":"CONCATENATE($C$6,'A&V_Verk.&GD'!B19)","v":"GD1"},{"$f":"IF(ISERROR(VLOOKUP($A14,'A&V_Verk.&GD'!$A:$J,3,FALSE)),\"\",(VLOOKUP($A14,'A&V_Verk.&GD'!$A:$J,3,FALSE)))","v":"Predigtgottesdienste"},{"$f":"IF(ISERROR(VLOOKUP($A14,'A&V_Verk.&GD'!$A:$J,6,FALSE)),\"\",(VLOOKUP($A14,'A&V_Verk.&GD'!$A:$J,6,FALSE)))","v":0},{"$f":"IF(ISERROR(VLOOKUP($A14,'A&V_Verk.&GD'!$A:$J,7,FALSE)),\"\",(VLOOKUP($A14,'A&V_Verk.&GD'!$A:$J,7,FALSE)))","v":1.2},{"$f":"IF(ISERROR(VLOOKUP($A14,'A&V_Verk.&GD'!$A:$J,8,FALSE)),\"\",(VLOOKUP($A14,'A&V_Verk.&GD'!$A:$J,8,FALSE)))","v":0},{"$f":"IF(ISERROR(VLOOKUP($A14,'A&V_Verk.&GD'!$A:$J,9,FALSE)),\"\",(VLOOKUP($A14,'A&V_Verk.&GD'!$A:$J,9,FALSE)))","v":0},{"$f":"IF(ISERROR(VLOOKUP($A14,'A&V_Verk.&GD'!$A:$J,10,FALSE)),\"\",(VLOOKUP($A14,'A&V_Verk.&GD'!$A:$J,10,FALSE)))","v":0}]
[{"$f":"CONCATENATE($C$6,'A&V_Verk.&GD'!B20)","v":"GD2"},{"$f":"IF(ISERROR(VLOOKUP($A15,'A&V_Verk.&GD'!$A:$J,3,FALSE)),\"\",(VLOOKUP($A15,'A&V_Verk.&GD'!$A:$J,3,FALSE)))","v":"Festtagsgottesdienste"},{"$f":"IF(ISERROR(VLOOKUP($A15,'A&V_Verk.&GD'!$A:$J,6,FALSE)),\"\",(VLOOKUP($A15,'A&V_Verk.&GD'!$A:$J,6,FALSE)))","v":0},{"$f":"IF(ISERROR(VLOOKUP($A15,'A&V_Verk.&GD'!$A:$J,7,FALSE)),\"\",(VLOOKUP($A15,'A&V_Verk.&GD'!$A:$J,7,FALSE)))","v":1.5},{"$f":"IF(ISERROR(VLOOKUP($A15,'A&V_Verk.&GD'!$A:$J,8,FALSE)),\"\",(VLOOKUP($A15,'A&V_Verk.&GD'!$A:$J,8,FALSE)))","v":0},{"$f":"IF(ISERROR(VLOOKUP($A15,'A&V_Verk.&GD'!$A:$J,9,FALSE)),\"\",(VLOOKUP($A15,'A&V_Verk.&GD'!$A:$J,9,FALSE)))","v":0},{"$f":"IF(ISERROR(VLOOKUP($A15,'A&V_Verk.&GD'!$A:$J,10,FALSE)),\"\",(VLOOKUP($A15,'A&V_Verk.&GD'!$A:$J,10,FALSE)))","v":0}]
[{"$f":"CONCATENATE($C$6,'A&V_Verk.&GD'!B21)","v":"GD3"},{"$f":"IF(ISERROR(VLOOKUP($A16,'A&V_Verk.&GD'!$A:$J,3,FALSE)),\"\",(VLOOKUP($A16,'A&V_Verk.&GD'!$A:$J,3,FALSE)))","v":"Liturgische Feiern"},{"$f":"IF(ISERROR(VLOOKUP($A16,'A&V_Verk.&GD'!$A:$J,6,FALSE)),\"\",(VLOOKUP($A16,'A&V_Verk.&GD'!$A:$J,6,FALSE)))","v":0},{"$f":"IF(ISERROR(VLOOKUP($A16,'A&V_Verk.&GD'!$A:$J,7,FALSE)),\"\",(VLOOKUP($A16,'A&V_Verk.&GD'!$A:$J,7,FALSE)))","v":0.5},{"$f":"IF(ISERROR(VLOOKUP($A16,'A&V_Verk.&GD'!$A:$J,8,FALSE)),\"\",(VLOOKUP($A16,'A&V_Verk.&GD'!$A:$J,8,FALSE)))","v":0},{"$f":"IF(ISERROR(VLOOKUP($A16,'A&V_Verk.&GD'!$A:$J,9,FALSE)),\"\",(VLOOKUP($A16,'A&V_Verk.&GD'!$A:$J,9,FALSE)))","v":0},{"$f":"IF(ISERROR(VLOOKUP($A16,'A&V_Verk.&GD'!$A:$J,10,FALSE)),\"\",(VLOOKUP($A16,'A&V_Verk.&GD'!$A:$J,10,FALSE)))","v":0}]
[{"$f":"CONCATENATE($C$6,'A&V_Verk.&GD'!B22)","v":"GD4"},{"$f":"IF(ISERROR(VLOOKUP($A17,'A&V_Verk.&GD'!$A:$J,3,FALSE)),\"\",(VLOOKUP($A17,'A&V_Verk.&GD'!$A:$J,3,FALSE)))","v":"Abdankungen"},{"$f":"IF(ISERROR(VLOOKUP($A17,'A&V_Verk.&GD'!$A:$J,6,FALSE)),\"\",(VLOOKUP($A17,'A&V_Verk.&GD'!$A:$J,6,FALSE)))","v":0},{"$f":"IF(ISERROR(VLOOKUP($A17,'A&V_Verk.&GD'!$A:$J,7,FALSE)),\"\",(VLOOKUP($A17,'A&V_Verk.&GD'!$A:$J,7,FALSE)))","v":1.5},{"$f":"IF(ISERROR(VLOOKUP($A17,'A&V_Verk.&GD'!$A:$J,8,FALSE)),\"\",(VLOOKUP($A17,'A&V_Verk.&GD'!$A:$J,8,FALSE)))","v":0},{"$f":"IF(ISERROR(VLOOKUP($A17,'A&V_Verk.&GD'!$A:$J,9,FALSE)),\"\",(VLOOKUP($A17,'A&V_Verk.&GD'!$A:$J,9,FALSE)))","v":0},{"$f":"IF(ISERROR(VLOOKUP($A17,'A&V_Verk.&GD'!$A:$J,10,FALSE)),\"\",(VLOOKUP($A17,'A&V_Verk.&GD'!$A:$J,10,FALSE)))","v":0}]
[{"$f":"CONCATENATE($C$6,'A&V_Verk.&GD'!B23)","v":"GD5"},{"$f":"IF(ISERROR(VLOOKUP($A18,'A&V_Verk.&GD'!$A:$J,3,FALSE)),\"\",(VLOOKUP($A18,'A&V_Verk.&GD'!$A:$J,3,FALSE)))","v":"Beisetzung am Grab"},{"$f":"IF(ISERROR(VLOOKUP($A18,'A&V_Verk.&GD'!$A:$J,6,FALSE)),\"\",(VLOOKUP($A18,'A&V_Verk.&GD'!$A:$J,6,FALSE)))","v":0},{"$f":"IF(ISERROR(VLOOKUP($A18,'A&V_Verk.&GD'!$A:$J,7,FALSE)),\"\",(VLOOKUP($A18,'A&V_Verk.&GD'!$A:$J,7,FALSE)))","v":0.8},{"$f":"IF(ISERROR(VLOOKUP($A18,'A&V_Verk.&GD'!$A:$J,8,FALSE)),\"\",(VLOOKUP($A18,'A&V_Verk.&GD'!$A:$J,8,FALSE)))","v":0},{"$f":"IF(ISERROR(VLOOKUP($A18,'A&V_Verk.&GD'!$A:$J,9,FALSE)),\"\",(VLOOKUP($A18,'A&V_Verk.&GD'!$A:$J,9,FALSE)))","v":0},{"$f":"IF(ISERROR(VLOOKUP($A18,'A&V_Verk.&GD'!$A:$J,10,FALSE)),\"\",(VLOOKUP($A18,'A&V_Verk.&GD'!$A:$J,10,FALSE)))","v":0}]
[{"$f":"CONCATENATE($C$6,'A&V_Verk.&GD'!B24)","v":"GD6"},{"$f":"IF(ISERROR(VLOOKUP($A19,'A&V_Verk.&GD'!$A:$J,3,FALSE)),\"\",(VLOOKUP($A19,'A&V_Verk.&GD'!$A:$J,3,FALSE)))","v":"Taufen (im Gemeindegottesdienst)"},{"$f":"IF(ISERROR(VLOOKUP($A19,'A&V_Verk.&GD'!$A:$J,6,FALSE)),\"\",(VLOOKUP($A19,'A&V_Verk.&GD'!$A:$J,6,FALSE)))","v":0},{"$f":"IF(ISERROR(VLOOKUP($A19,'A&V_Verk.&GD'!$A:$J,7,FALSE)),\"\",(VLOOKUP($A19,'A&V_Verk.&GD'!$A:$J,7,FALSE)))","v":0.5},{"$f":"IF(ISERROR(VLOOKUP($A19,'A&V_Verk.&GD'!$A:$J,8,FALSE)),\"\",(VLOOKUP($A19,'A&V_Verk.&GD'!$A:$J,8,FALSE)))","v":0},{"$f":"IF(ISERROR(VLOOKUP($A19,'A&V_Verk.&GD'!$A:$J,9,FALSE)),\"\",(VLOOKUP($A19,'A&V_Verk.&GD'!$A:$J,9,FALSE)))","v":0},{"$f":"IF(ISERROR(VLOOKUP($A19,'A&V_Verk.&GD'!$A:$J,10,FALSE)),\"\",(VLOOKUP($A19,'A&V_Verk.&GD'!$A:$J,10,FALSE)))","v":0}]
[{"$f":"CONCATENATE($C$6,'A&V_Verk.&GD'!B25)","v":"GD7"},{"$f":"IF(ISERROR(VLOOKUP($A20,'A&V_Verk.&GD'!$A:$J,3,FALSE)),\"\",(VLOOKUP($A20,'A&V_Verk.&GD'!$A:$J,3,FALSE)))","v":"Trauungen als eigene gottesdienstliche Feier"},{"$f":"IF(ISERROR(VLOOKUP($A20,'A&V_Verk.&GD'!$A:$J,6,FALSE)),\"\",(VLOOKUP($A20,'A&V_Verk.&GD'!$A:$J,6,FALSE)))","v":0},{"$f":"IF(ISERROR(VLOOKUP($A20,'A&V_Verk.&GD'!$A:$J,7,FALSE)),\"\",(VLOOKUP($A20,'A&V_Verk.&GD'!$A:$J,7,FALSE)))","v":1.5},{"$f":"IF(ISERROR(VLOOKUP($A20,'A&V_Verk.&GD'!$A:$J,8,FALSE)),\"\",(VLOOKUP($A20,'A&V_Verk.&GD'!$A:$J,8,FALSE)))","v":0},{"$f":"IF(ISERROR(VLOOKUP($A20,'A&V_Verk.&GD'!$A:$J,9,FALSE)),\"\",(VLOOKUP($A20,'A&V_Verk.&GD'!$A:$J,9,FALSE)))","v":0},{"$f":"IF(ISERROR(VLOOKUP($A20,'A&V_Verk.&GD'!$A:$J,10,FALSE)),\"\",(VLOOKUP($A20,'A&V_Verk.&GD'!$A:$J,10,FALSE)))","v":0}]
{"$rows_left_out":126}
{"sheet":"Grafik Gesamtpensum","index":9,"n_rows":16,"n_cols":3,"rows_kept":16,"cut":false,"hidden":false,"merged":[]}
["Grafische Darstellung Gesamtpensum"]
[]
[]
[]
["Arbeitsbereich",{"$f":"'A&V_Verk.&GD'!I17","v":"Summe Zeitbedarf in AT"},"%-Anteil"]
[]
[" Gottesdienst / Kasualien",{"$f":"'A&V_Verk.&GD'!I18","v":0},{"$f":"IF($B$16=0,0,B7/$B$16)","v":0}]
[" Seelsorge",{"$f":"'A&V_Diak.&Seels.'!I18","v":0},0]
[" Diakonie",{"$f":"'A&V_Diak.&Seels.'!I160","v":0},0]
[" Seniorenarbeit",{"$f":"'A&V_Diak.&Seels.'!I291","v":0},0]
[" Konfirmandenarbeit und rpg",{"$f":"'A&V_Bild.&Spirit.'!I18","v":0},0]
[" Erwachsenenbildung",{"$f":"'A&V_Bild.&Spirit.'!I184","v":0},0]
[" Gemeindeleitung",{"$f":"'A&V_Aufb.&Leit.'!I18","v":0},0]
[" Gemeindeaufbau",{"$f":"'A&V_Aufb.&Leit.'!I179","v":0},0]
[" Weitere Dienste",{"$f":"'A&V_W.Dienste'!I18","v":0},0]
["Summe",{"$f":"SUM(B7:B15)","v":0},{"$f":"SUM(C7:C15)","v":0}]

{"sheet":"Gesetzestexte","index":10,"n_rows":23,"n_cols":2,"rows_kept":23,"cut":false,"hidden":true,"merged":[]}
[null,"Gesetzestexte und Erläuterungen"]
[]
[null,"Auszug aus der Kirchenordnung (KO, LS 181.10)"]
[]
[null,"tbu\nHier folgen die relevanten Gesetzestexte"]
[]
[null,"Auszug aus der Kirchenordnung (KO, LS 181.10)"]
[null,"§ 15\n1\nDie Landeskirche arbeitet mit der Theologischen Fakultät  der  Universität  Zürich  zusammen,  namentlich  bei  der  Aus-  und  Weiterbildung  von  Theologinnen  und  Theologen  sowie  zur  Bearbei-tung wissenschaftlich-theologischer Fragestellungen.\n2\nDer Kirchenrat nimmt zu Berufungsanträgen der Theologischen Fakultät Stellung.\n3\nDie Theologische Fakultät ist eingeladen, eine Vertretung in die Kirchensynode abzuordnen\n3 Der Kirchenrat regelt in der Vollzugsverordnung die Berechnung des Ferienanspruchs und den Bezug der Ferien."]
[]
[null,"Pfarramtliche Aufgaben gemäss Art. 112 und 113 der Kirchenordnung werden in der Kirchgemeinde wahrgenommen. Über Ausnahmen entscheidet die Kirchenpflege. \nDer Pfarrkonvent organisiert die Aufgaben- und Verantwortungsbereiche in Bezug auf die einzelnen Pfarrstellen und Pfarrpersonen. Er berücksichtigt dabei insbesondere die durch die Kirchenpflege festgelegte strategische Ausrichtung der Kirchgemeinde sowie von der Kirchenpflege erteilte Kommissions- oder Teamaufträge"]
[]
[]
[null,"§ 115 \n1 In Kirchgemeinden mit einem Pfarrkonvent erarbeitet dieser innert sechs Monaten seit der letzten Wahl gemäss Art. 125 eine Pfarrdienstordnung und legt sie der Kirchenpflege zur Genehmigung vor.\n2 Die Pfarrdienstordnung bezweckt insbesondere, die Arbeit der Pfarrerinnen und Pfarrer unter Wahrung des Gesamtzusammenhanges der Gemeinde unter diesen aufzuteilen.\n"]
[]
[null,"§ 29 \n1 Die Landeskirche nimmt ihren Auftrag wahr durch die Verkündigung des Evangeliums in Wort und Tat in den vier Handlungsfeldern Verkündigung und Gottesdienst, Diakonie und Seelsorge, Bildung und Spiritualität sowie Gemeindeaufbau und Leitung.\n"]
[]
[null,"§ 150 1 Die Kirchenpflege, die Pfarrerinnen und Pfarrer sowie die Angestellten sind in gemeinsamer Verantwortung zum Aufbau der Gemeinde gerufen.\n2 Die Kirchenpflege nimmt ihre Aufgaben im Rahmen der behördlichen Verantwortung gemäss Kirchenordnung und kantonalem Recht wahr.\n3 Die Pfarrerinnen und Pfarrer sowie die Angestellten erfüllen ihre Aufgaben je in ihrem besonderen Dienst gemäss der Kirchenordnung, den Vorgaben der Kirchenpflege und den besonderen Gegebenheiten der Kirchgemeinde.\n"]
[]
[]
[]
{"$rows_left_out":3}