{"text_format":"1","workbook":"xlsx","n_sheets":21,"sheets":["Inhalt","Vorbemerkung","Instruktion","Pfarrpersonen","Pfarrkonvent","Erw_Pfarramt","Erw_Verk.&GD","Tabelle2","Tabelle1","A&V_Verk.&GD","Erw_Diak.&Seels.","A&V_Diak.&Seels.","Tabelle3","Erw_Bild.&Spirit.","A&V_Bild.&Spirit.","Erw_Aufb.&Leit.","A&V_Aufb.&Leit.","Erw_W.Dienste","A&V_W.Dienste","Stellenbeschrieb Einzelperson","Gesetzestexte"],"not_rendered":{"charts":0,"images":3,"macros":1,"external_links":0,"defined_names":72,"comments":0,"pivot_tables":1},"unopened":[],"bounds":{"document_bytes":16777216,"sheet_cells":100000,"rows_first":2000,"rows_last":500,"rows_between":2000,"halvings":0,"cell_chars":16384,"cell_head_chars":4096},"cells_cut":0,"cells_raw":0,"read":"whole","date_system":"1900"}

{"sheet":"Inhalt","index":0,"n_rows":51,"n_cols":2,"rows_kept":51,"cut":false,"hidden":false,"merged":[[22,1,22,2],[33,1,33,5],[31,1,31,2]]}
[]
[]
[]
[]
[]
[null,"Leitfaden und Formular"]
[]
[null,"Pfarrdienstordnung"]
[]
[null,"unter Berücksichtigung der Aufgaben- und "]
[null,"Verantwortungsbereiche im Gemeindepfarramt"]
[null,"und der strategischen Vorgaben durch die Kirchenpflegen"]
[]
[null,"Vorbemerkungen"]
[]
[null,"Instruktion"]
[]
[null,"Übersicht Pfarrpersonen und Pfarrstellenprozente"]
[]
[null,"Pfarrkonvent"]
{"$rows_left_out":32}
{"sheet":"Vorbemerkung","index":1,"n_rows":0,"n_cols":0,"rows_kept":0,"cut":false,"hidden":false,"merged":[]}

{"sheet":"Instruktion","index":2,"n_rows":0,"n_cols":0,"rows_kept":0,"cut":false,"hidden":false,"merged":[]}

{"sheet":"Pfarrpersonen","index":3,"n_rows":61,"n_cols":11,"rows_kept":61,"cut":false,"hidden":false,"merged":[[18,1,18,2],[17,1,17,2],[6,1,6,2],[7,1,7,2],[8,1,8,2],[9,1,9,2],[10,1,10,2],[11,1,11,2],[12,1,12,2],[13,1,13,2],[14,1,14,2],[15,1,15,2],[16,1,16,2],[19,1,19,2],[20,1,20,2],[21,1,21,2],[22,1,22,2],[22,11,22,13]]}
[]
[]
[null,null,null,null,null,null,null,"Anzahl Gemeinde-mitglieder","Stellenprozente Gesamtgemeinde \n(2000 Gemeindemitglieder = 100% Stelle; ab 2000 Mitglieder jeweils \n5 Stellenprozente zusätzlich pro 825 Mitglieder)"]
["Übersicht Pfarrpersonen und Pfarrstellenprozente",null,null,null,null,null,null,null,{"$f":"IF(H4>2000,H4/2000+(ROUNDUP(H4/825,0)*5/100),H4/2000)","v":0}]
[]
[]
["Kürzel","Name",null,"Vorname","AHV-Nummer","Alter","Beschäftigungsgrad in Stellenprozenten","Zur Verfügung stehende Arbeitstage","Status \n(Stellvertretung, Projektstelle, \ngemeindeeigene Stelle, etc.)","In der KG seit","Datum der Wahl"]
["Gesamtpensum",null,null,null,null,null,{"$f":"G23","v":0},{"$f":"H23","v":0}]
["Delta",null,null,null,null,null,null,{"$f":"IF(F9>59,(($B$33-(5.5-0.75))*G9),$B$33*G9)","v":0}]
[null,null,null,null,null,null,null,{"$f":"IF(F10>59,(($B$33-(5.5-0.75))*G10),$B$33*G10)","v":0}]
[null,null,null,null,null,null,null,0]
[null,null,null,null,null,null,null,0]
[null,null,null,null,null,null,null,0]
[null,null,null,null,null,null,null,0]
[null,null,null,null,null,null,null,0]
[null,null,null,null,null,null,null,0]
[null,null,null,null,null,null,null,0]
[null,null,null,null,null,null,null,0]
[null,null,null,null,null,null,null,0]
[null,null,null,null,null,null,null,0]
{"$rows_left_out":42}
{"sheet":"Pfarrkonvent","index":4,"n_rows":24,"n_cols":9,"rows_kept":24,"cut":false,"hidden":false,"merged":[[21,0,21,11],[1,5,1,10],[10,0,10,11],[13,0,13,11],[16,0,16,11],[19,0,19,11]]}
[]
[null,null,null,null,"Pfarrkonvent Kirchgemeinde"]
[]
["1. Stellenzuteilung"]
["Der Kirchgemeinde wurden ",null,null,null," Pfarrstellenprozente zur Ausgestaltung des Pfarramts"]
["gemäss Art. 115 der Kirchenordnung der evangelisch reformierten Landeskirche Zürich \n"]
["(KO; LS 181.10) zugeteilt."]
["Allenfalls verfügt die Kirchgemeinde über ",null,null,null,null,null," Pfarrstellenprozente an sogenannt „weiteren "]
["Pfarrstellen“ gemäss Art. 117 Abs. 4 KO oder über ",null,null,null,null,null,null,null," Pfarrstellenprozente "]
["an gemeindeeigenen Pfarrstellen. "]
["Die Kirchenpflege entscheidet über die Verteilung des Gesamtpools auf einzelne Pfarrstellen und Pfarrpersonen. (Liste der Pfarrstellen mit Stellenpensum und Name der Pfarrpersonen im Anhang.)\n\n"]
[]
["2. Pfarrkonvent und Pfarrdienstordnung"]
["Der Pfarrkonvent vertritt das Pfarramt und erstellt eine Pfarrdienstordnung im Einvernehmen mit der Kirchenpflege.\nDie Pfarrdienstordnung regelt den Pfarrdienst und legt die und Verantwortungs- und Aufgabenbereiche der Pfarrpersonen fest.\n\n"]
[]
["3. Strategische Ziele, Kommissions- und Teamaufträge, Projekte"]
["Die Kirchenpflege legt in Zusammenarbeit mit dem Pfarr- und dem Gemeindekonvent die strategischen Ziele fest und erteilt entsprechende Aufträge. Diese werden in der Pfarrdienstordnung abgebildet. Der Pfarrkonvent kann eigene Projekte zu Handen der Kirchenpflege entwickeln zur Förderung von Innovation und Pionierarbeit im Pfarramt und zur Förderung der Vielfalt kirchlicher Orte und Formen des gemeindlichen Lebens. Er achtet auf lebensweltliche und lebensräumliche Orientierung."]
[]
["4. Allgemeine pfarramtliche Dienste"]
["Die Teilnahme an den Sitzungen der Kirchenpflege wird von der durch den Pfarrkonvent bestimmten Vertretung wahrgenommen.\nDie Teilnahme an den Sitzungen des Pfarrkonvents ist für alle Pfarrpersonen verbindlich. \nDie Übernahme von allgemeinen Aufgaben für die Gemeindeleitung, den Pfarrkonvent und das Pfarrkapitel ist Teil des pfarramtlichen Dienstes.\nWeiterbildung ist Teil des pfarramtlichen Dienstes. \nDer Pfarrkonvent regelt die Erreichbarkeit und Verfügbarkeit im Pfarramt. \n\n\n\n\n\n\n"]
{"$rows_left_out":5}
{"sheet":"Erw_Pfarramt","index":5,"n_rows":3,"n_cols":4,"rows_kept":3,"cut":false,"hidden":false,"merged":[[0,1,0,2],[2,3,13,3]]}
[null,"Erwägung Pfarramt"]
[]
[null,null,null,"Hier ist festzuhalten, wie das Pfarramt zusammengesetzt ist bezüglich Berufserfahrung, besonderer Fähigkeiten und Kompetenzen, Zusatzausbildungen, theologischer Ausrichtung etc. der einzelnen Pfarrpersonen. "]

{"sheet":"Erw_Verk.&GD","index":6,"n_rows":141,"n_cols":4,"rows_kept":141,"cut":false,"hidden":false,"merged":[[0,1,0,2],[139,1,139,2],[2,3,13,3],[27,3,38,3],[54,3,65,3],[104,3,116,3]]}
[null,"Pfarramtliche Verantwortungsbereiche im Handlungsfeld \nVerkündigung und Gottesdienst"]
[]
[null,null,null,"Hier ist festzuhalten, wie Verkündigung und Gottesdienst grundsätzlich organisiert sind und wie die Vorgaben der Kirchenpflege umgesetzt werden. Einzutragen ist auch, wie die Erreichbarkeit des Pfarramts organisiert ist, insbesondere betreffend Kasualien. Die theologische Reflexion des Handlungfeldes sollte sich hier zusammengefasst abbilden. "]
[]
[]
[]
[]
[]
[]
[]
[]
[]
[]
[]
[]
[]
[]
[]
[]
[]
{"$rows_left_out":122}
{"sheet":"Tabelle2","index":7,"n_rows":0,"n_cols":0,"rows_kept":0,"cut":false,"hidden":false,"merged":[]}

{"sheet":"Tabelle1","index":8,"n_rows":0,"n_cols":0,"rows_kept":0,"cut":false,"hidden":false,"merged":[]}

{"sheet":"A&V_Verk.&GD","index":9,"n_rows":194,"n_cols":8,"rows_kept":194,"cut":false,"hidden":false,"merged":[[1,7,4,7],[1,8,4,8],[11,2,13,5],[2,2,2,6],[9,2,9,6],[10,2,10,5]]}
[null,null,"Pfarramtliche Aufgaben- und Verantwortungsbereiche im Handlungsfeld Verkündigung und Gottesdienst"]
[]
[]
[]
[]
[]
[]
[]
[]
[]
[]
[]
[]
[]
[]
[null,null,"Pfarrpersonen",null,null,{"$f":"Pfarrpersonen!A8","v":"Gesamtpensum"}]
[{"$f":"CONCATENATE($F$16,B17)","v":"GesamtpensumGD0"},"GD0","Arbeitsbereich Gottesdienst / Kasualien",null,null,"Anzahl","Bemerkung (Hauptverantwortung, Planung, konzeptioneller Ansatz)","Erklärungen zu den Berechnung / Kalkulations-Faktoren "]
[]
[{"$f":"CONCATENATE($F$16,B19)","v":"GesamtpensumGD1"},"GD1","Predigtgottesdienste",null,null,null,null,"Durchschnittlicher Aufwand  1.2 AT pro GD"]
["GesamtpensumGD2","GD2","Festtagsgottesdienste",null,null,null,null,"Durchschnittlicher Aufwand  1 .5 AT pro GD"]
{"$rows_left_out":175}
{"sheet":"Erw_Diak.&Seels.","index":10,"n_rows":105,"n_cols":4,"rows_kept":105,"cut":false,"hidden":false,"merged":[[0,1,0,2],[2,3,13,3],[27,3,38,3],[54,3,65,3],[104,3,116,3]]}
[null,"Pfarramtliche Verantwortungsbereiche im Handlungsfeld \nDiakonie und Seelsorge"]
[]
[null,null,null,"Hier ist festzuhalten, wie Diakonie und Seelsorge grundsätzlich organisiert sind und wie die Vorgaben der Kirchenpflege umgesetzt werden. Die theologische Reflexion des Handlungsfeldes sollte sich hier zusammengefasst abbilden. "]
[]
[]
[]
[]
[]
[]
[]
[]
[]
[]
[]
[]
[]
[]
[]
[]
[]
{"$rows_left_out":86}
{"sheet":"A&V_Diak.&Seels.","index":11,"n_rows":437,"n_cols":8,"rows_kept":437,"cut":false,"hidden":false,"merged":[[9,2,9,6],[1,7,4,7],[2,2,2,6]]}
[null,null,"Pfarramtliche Aufgaben- und Verantwortungsbereiche im Handlungsfeld Diakonie und Seelsorge"]
[]
[]
[]
[]
[]
[]
[]
[]
[]
[]
[]
[]
[]
[null,null,"Seelsorge "]
[null,null,"Pfarrpersonen",null,null,{"$f":"Pfarrpersonen!A8","v":"Gesamtpensum"}]
[{"$f":"CONCATENATE($F$16,B17)","v":"GesamtpensumSEE0"},"SEE0","Arbeitsbereich Seelsorge",null,null,"Anzahl","Bemerkung (Hauptverantwortung, Planung, konzeptioneller Ansatz)","Erklärungen zu den Berechnung / Kalkulations-Faktoren "]
[]
[{"$f":"CONCATENATE($F$16,B19)","v":"GesamtpensumSEE1"},"SEE1","Seelsorge in der Gemeinde \n(Anzahl zugewandte Mitglieder)",null,null,null,null,"Eingabe: Anzahl zugewandter Gemeindemitglieder, \nFaktor: durchschn. 0.01 AT pro Mitglied pro Jahr  bzw. 0.5AT pro Woche \nin einem 100% Pensum "]
["GesamtpensumSEE2","SEE2","Betreuung von Gruppen \n(AZ Gruppen)",null,null,null,null,"Eingabe: Anzahl Gruppen, Faktor: 1 AT pro Gruppe pro Jahr"]
{"$rows_left_out":418}
{"sheet":"Tabelle3","index":12,"n_rows":0,"n_cols":0,"rows_kept":0,"cut":false,"hidden":false,"merged":[]}

{"sheet":"Erw_Bild.&Spirit.","index":13,"n_rows":105,"n_cols":4,"rows_kept":105,"cut":false,"hidden":false,"merged":[[0,1,0,2],[2,3,13,3],[27,3,38,3],[54,3,65,3],[104,3,116,3]]}
[null,"Pfarramtliche Verantwortungsbereiche im Handlungsfeld \nBildung und Spiritualität"]
[]
[null,null,null,"Hier ist festzuhalten, wie Bildung und Spiritualität grundsätzlich organisiert sind und wie die Vorgaben der Kirchenpflege umgesetzt werden. Die theologische Reflexion des Handlungsfeldes sollte sich hier zusammengefasst abbilden. "]
[]
[]
[]
[]
[]
[]
[]
[]
[]
[]
[]
[]
[]
[]
[]
[]
[]
{"$rows_left_out":86}
{"sheet":"A&V_Bild.&Spirit.","index":14,"n_rows":320,"n_cols":8,"rows_kept":320,"cut":false,"hidden":false,"merged":[[1,7,4,7],[2,2,2,6],[9,2,9,6]]}
[null,null,"Pfarramtliche Aufgaben- und Verantwortungsbereiche im Handlungsfeld Bildung und Spiritualität"]
[]
[]
[]
[]
[]
[]
[]
[]
[]
[]
[]
[]
[]
[]
[null,null,"Pfarrpersonen",null,null,{"$f":"Pfarrpersonen!A8","v":"Gesamtpensum"}]
[{"$f":"CONCATENATE($F$16,B17)","v":"GesamtpensumK0"},"K0","Arbeitsbereich Konfirmandenarbeit und rpg",null,null,"Anzahl ","Bemerkung (Hauptverantwortung, Planung, konzeptioneller Ansatz)","Erklärungen zu den Berechnung / Kalkulations-Faktoren "]
[]
[{"$f":"CONCATENATE($F$16,B19)","v":"GesamtpensumK1"},"K1","Konfirmandenunterricht (AZ Lektionen)",null,null,null,null,"Eingabe: Anzahl Lektionen pro Jahr à 60 Min., \nFaktor: 2 h pro 60 Min.-Lektion "]
["GesamtpensumK2","K2","Juki-Lektionen",null,null,null,null,"Eingabe: Anzahl Lektionen pro Jahr à 60 Min., \nFaktor: 2 h pro 60 Min.-Lektion "]
{"$rows_left_out":301}
{"sheet":"Erw_Aufb.&Leit.","index":15,"n_rows":105,"n_cols":4,"rows_kept":105,"cut":false,"hidden":false,"merged":[[0,1,0,2],[2,3,13,3],[27,3,38,3],[54,3,65,3],[104,3,116,3]]}
[null,"Pfarramtliche Verantwortungsbereiche im Handlungsfeld \nGemeindeaufbau und Leitung"]
[]
[null,null,null,"Hier ist festzuhalten, wie Gemeindeaufbau und Leitung grundsätzlich organisiert sind und wie die Vorgaben der Kirchenpflege betreffend Leitung auf der operativen Ebene umgesetzt werden. Die theologische Reflexion der Organisation der Gemeinde sollte sich hier zusammengefasst abbilden. "]
[]
[]
[]
[]
[]
[]
[]
[]
[]
[]
[]
[]
[]
[]
[]
[]
[]
{"$rows_left_out":86}
{"sheet":"A&V_Aufb.&Leit.","index":16,"n_rows":336,"n_cols":8,"rows_kept":336,"cut":false,"hidden":false,"merged":[[1,7,4,7],[2,2,2,6],[9,2,9,6]]}
[null,null,"Pfarramtliche Aufgaben- und Verantwortungsbereiche im Handlungsfeld Gemeindeaufbau und Leitung"]
[]
[]
[]
[]
[]
[]
[]
[]
[]
[]
[]
[]
[]
[null,null,"Gemeindeleitung"]
[null,null,"Pfarrpersonen",null,null,{"$f":"Pfarrpersonen!A8","v":"Gesamtpensum"}]
[{"$f":"CONCATENATE($F$16,B17)","v":"GesamtpensumG0"},"G0","Arbeitsbereich Gemeindeleitung",null,null,"Anzahl","Bemerkung (Hauptverantwortung, Planung, konzeptioneller Ansatz)","Erklärungen zu den Berechnung / Kalkulations-Faktoren "]
[]
[{"$f":"CONCATENATE($F$16,B19)","v":"GesamtpensumG1"},"G1","Sitzungen Pfarrkonvent",null,null,null,null,"Eingabe: Anzahl Sitzungen pro Jahr, Faktor: 2 h pro Sitzung"]
["GesamtpensumG2","G2","Leitung Pfarrkonvent (in AT)",null,null,null,null,"Geschätzter Aufwand in Tagen pro Jahr"]
{"$rows_left_out":317}
{"sheet":"Erw_W.Dienste","index":17,"n_rows":1,"n_cols":2,"rows_kept":1,"cut":false,"hidden":false,"merged":[[0,1,0,2],[2,3,13,3],[27,3,38,3]]}
[null,"Pfarramtliche Verantwortungsbereiche im Zusammenhang mit weiteren Diensten und Verpflichtungen"]

{"sheet":"A&V_W.Dienste","index":18,"n_rows":154,"n_cols":8,"rows_kept":154,"cut":false,"hidden":false,"merged":[[1,7,4,7],[2,2,2,6],[8,2,8,6]]}
[null,null,"Pfarramtliche Aufgaben- und Verantwortungsbereiche im Zusammenhang mit weiteren Diensten"]
[]
[]
[]
[]
[]
[]
[]
[]
[]
[]
[]
[]
[]
[]
[null,null,"Pfarrpersonen",null,null,{"$f":"Pfarrpersonen!A8","v":"Gesamtpensum"}]
[{"$f":"CONCATENATE($F$16,B17)","v":"GesamtpensumWD0"},"WD0","Arbeitsbereich Weitere Dienste",null,null,"Anzahl ","Bemerkung (Hauptverantwortung, Planung, konzeptioneller Ansatz)","Erklärungen zu den Berechnung / Kalkulations-Faktoren "]
[]
[{"$f":"CONCATENATE($F$16,B19)","v":"GesamtpensumWD1"},"WD1","Armeeseelsorge",null,null,null,null,"Anzahl Tage pro Jahr"]
["GesamtpensumWD2","WD2","Militär- / Bevölkerungsschutzdienst",null,null,null,null,"Anzahl Tage pro Jahr"]
{"$rows_left_out":135}
{"sheet":"Stellenbeschrieb Einzelperson","index":19,"n_rows":144,"n_cols":7,"rows_kept":144,"cut":false,"hidden":false,"merged":[[136,1,141,6],[136,7,141,7]]}
[null,null,"a"]
[null,null,"a"]
[null,null,"a"]
[null,"Pfarramtlicher Aufgaben- und Verantwortungsbereichsbericht"]
[null,null,"a"]
[null,"Pfarrperson: ",null,null,null,null,{"$f":"IF(C6=\"\",\"\",CONCATENATE(VLOOKUP(C6,Pfarrpersonen!A7:D17,2,FALSE),\" \",VLOOKUP(C6,Pfarrpersonen!A7:D17,4,FALSE)))","v":""}]
[null,"Pensum: ",{"$f":"IF(ISERROR(VLOOKUP(C6,Pfarrpersonen!$A$7:$H$22,7,FALSE)),\"\",VLOOKUP(C6,Pfarrpersonen!$A$7:$H$22,7,FALSE))","v":""}]
[]
[]
[null,null,"a"]
[{"$f":"CONCATENATE($C$6,'A&V_Verk.&GD'!B17)","v":"GD0"},{"$f":"'A&V_Verk.&GD'!C17","v":"Arbeitsbereich Gottesdienst / Kasualien"},{"$f":"'A&V_Verk.&GD'!F17","v":"Anzahl"},null,null,null,{"$f":"'A&V_Verk.&GD'!G17","v":"Bemerkung (Hauptverantwortung, Planung, konzeptioneller Ansatz)"}]
[null,null,"a"]
[{"$f":"CONCATENATE($C$6,'A&V_Verk.&GD'!B19)","v":"GD1"},{"$f":"IF(ISERROR(VLOOKUP($A13,'A&V_Verk.&GD'!$A:$G,3,FALSE)),\"\",(VLOOKUP($A13,'A&V_Verk.&GD'!$A:$G,3,FALSE)))","v":"Predigtgottesdienste"},{"$f":"IF(ISERROR(VLOOKUP($A13,'A&V_Verk.&GD'!$A:$G,6,FALSE)),\"\",(VLOOKUP($A13,'A&V_Verk.&GD'!$A:$G,6,FALSE)))","v":0},null,null,null,{"$f":"IF(ISERROR(VLOOKUP($A13,'A&V_Verk.&GD'!$A:$G,7,FALSE)),\"\",(VLOOKUP($A13,'A&V_Verk.&GD'!$A:$G,7,FALSE)))","v":0}]
[{"$f":"CONCATENATE($C$6,'A&V_Verk.&GD'!B20)","v":"GD2"},{"$f":"IF(ISERROR(VLOOKUP($A14,'A&V_Verk.&GD'!$A:$G,3,FALSE)),\"\",(VLOOKUP($A14,'A&V_Verk.&GD'!$A:$G,3,FALSE)))","v":"Festtagsgottesdienste"},{"$f":"IF(ISERROR(VLOOKUP($A14,'A&V_Verk.&GD'!$A:$G,6,FALSE)),\"\",(VLOOKUP($A14,'A&V_Verk.&GD'!$A:$G,6,FALSE)))","v":0},null,null,null,{"$f":"IF(ISERROR(VLOOKUP($A14,'A&V_Verk.&GD'!$A:$G,7,FALSE)),\"\",(VLOOKUP($A14,'A&V_Verk.&GD'!$A:$G,7,FALSE)))","v":0}]
[{"$f":"CONCATENATE($C$6,'A&V_Verk.&GD'!B21)","v":"GD3"},{"$f":"IF(ISERROR(VLOOKUP($A15,'A&V_Verk.&GD'!$A:$G,3,FALSE)),\"\",(VLOOKUP($A15,'A&V_Verk.&GD'!$A:$G,3,FALSE)))","v":"Liturgische Feiern"},{"$f":"IF(ISERROR(VLOOKUP($A15,'A&V_Verk.&GD'!$A:$G,6,FALSE)),\"\",(VLOOKUP($A15,'A&V_Verk.&GD'!$A:$G,6,FALSE)))","v":0},null,null,null,{"$f":"IF(ISERROR(VLOOKUP($A15,'A&V_Verk.&GD'!$A:$G,7,FALSE)),\"\",(VLOOKUP($A15,'A&V_Verk.&GD'!$A:$G,7,FALSE)))","v":0}]
[{"$f":"CONCATENATE($C$6,'A&V_Verk.&GD'!B22)","v":"GD4"},{"$f":"IF(ISERROR(VLOOKUP($A16,'A&V_Verk.&GD'!$A:$G,3,FALSE)),\"\",(VLOOKUP($A16,'A&V_Verk.&GD'!$A:$G,3,FALSE)))","v":"Abdankungen"},{"$f":"IF(ISERROR(VLOOKUP($A16,'A&V_Verk.&GD'!$A:$G,6,FALSE)),\"\",(VLOOKUP($A16,'A&V_Verk.&GD'!$A:$G,6,FALSE)))","v":0},null,null,null,{"$f":"IF(ISERROR(VLOOKUP($A16,'A&V_Verk.&GD'!$A:$G,7,FALSE)),\"\",(VLOOKUP($A16,'A&V_Verk.&GD'!$A:$G,7,FALSE)))","v":0}]
[{"$f":"CONCATENATE($C$6,'A&V_Verk.&GD'!B23)","v":"GD5"},{"$f":"IF(ISERROR(VLOOKUP($A17,'A&V_Verk.&GD'!$A:$G,3,FALSE)),\"\",(VLOOKUP($A17,'A&V_Verk.&GD'!$A:$G,3,FALSE)))","v":"Beisetzung am Grab"},{"$f":"IF(ISERROR(VLOOKUP($A17,'A&V_Verk.&GD'!$A:$G,6,FALSE)),\"\",(VLOOKUP($A17,'A&V_Verk.&GD'!$A:$G,6,FALSE)))","v":0},null,null,null,{"$f":"IF(ISERROR(VLOOKUP($A17,'A&V_Verk.&GD'!$A:$G,7,FALSE)),\"\",(VLOOKUP($A17,'A&V_Verk.&GD'!$A:$G,7,FALSE)))","v":0}]
[{"$f":"CONCATENATE($C$6,'A&V_Verk.&GD'!B24)","v":"GD6"},{"$f":"IF(ISERROR(VLOOKUP($A18,'A&V_Verk.&GD'!$A:$G,3,FALSE)),\"\",(VLOOKUP($A18,'A&V_Verk.&GD'!$A:$G,3,FALSE)))","v":"Taufen (im Gemeindegottesdienst)"},{"$f":"IF(ISERROR(VLOOKUP($A18,'A&V_Verk.&GD'!$A:$G,6,FALSE)),\"\",(VLOOKUP($A18,'A&V_Verk.&GD'!$A:$G,6,FALSE)))","v":0},null,null,null,{"$f":"IF(ISERROR(VLOOKUP($A18,'A&V_Verk.&GD'!$A:$G,7,FALSE)),\"\",(VLOOKUP($A18,'A&V_Verk.&GD'!$A:$G,7,FALSE)))","v":0}]
[{"$f":"CONCATENATE($C$6,'A&V_Verk.&GD'!B25)","v":"GD7"},{"$f":"IF(ISERROR(VLOOKUP($A19,'A&V_Verk.&GD'!$A:$G,3,FALSE)),\"\",(VLOOKUP($A19,'A&V_Verk.&GD'!$A:$G,3,FALSE)))","v":"Trauungen als eigene gottesdienstliche Feier"},{"$f":"IF(ISERROR(VLOOKUP($A19,'A&V_Verk.&GD'!$A:$G,6,FALSE)),\"\",(VLOOKUP($A19,'A&V_Verk.&GD'!$A:$G,6,FALSE)))","v":0},null,null,null,{"$f":"IF(ISERROR(VLOOKUP($A19,'A&V_Verk.&GD'!$A:$G,7,FALSE)),\"\",(VLOOKUP($A19,'A&V_Verk.&GD'!$A:$G,7,FALSE)))","v":0}]
[{"$f":"CONCATENATE($C$6,'A&V_Verk.&GD'!B26)","v":"GD8"},{"$f":"IF(ISERROR(VLOOKUP($A20,'A&V_Verk.&GD'!$A:$G,3,FALSE)),\"\",(VLOOKUP($A20,'A&V_Verk.&GD'!$A:$G,3,FALSE)))","v":"Taufen als eigene gottesdienstliche Feier"},{"$f":"IF(ISERROR(VLOOKUP($A20,'A&V_Verk.&GD'!$A:$G,6,FALSE)),\"\",(VLOOKUP($A20,'A&V_Verk.&GD'!$A:$G,6,FALSE)))","v":0},null,null,null,{"$f":"IF(ISERROR(VLOOKUP($A20,'A&V_Verk.&GD'!$A:$G,7,FALSE)),\"\",(VLOOKUP($A20,'A&V_Verk.&GD'!$A:$G,7,FALSE)))","v":0}]
{"$rows_left_out":125}
{"sheet":"Gesetzestexte","index":20,"n_rows":23,"n_cols":2,"rows_kept":23,"cut":false,"hidden":true,"merged":[]}
[null,"Gesetzestexte und Erläuterungen"]
[]
[null,"Auszug aus der Kirchenordnung (KO, LS 181.10)"]
[]
[null,"tbu\nHier folgen die relevanten Gesetzestexte"]
[]
[null,"Auszug aus der Kirchenordnung (KO, LS 181.10)"]
[null,"§ 15\n1\nDie Landeskirche arbeitet mit der Theologischen Fakultät  der  Universität  Zürich  zusammen,  namentlich  bei  der  Aus-  und  Weiterbildung  von  Theologinnen  und  Theologen  sowie  zur  Bearbei-tung wissenschaftlich-theologischer Fragestellungen.\n2\nDer Kirchenrat nimmt zu Berufungsanträgen der Theologischen Fakultät Stellung.\n3\nDie Theologische Fakultät ist eingeladen, eine Vertretung in die Kirchensynode abzuordnen\n3 Der Kirchenrat regelt in der Vollzugsverordnung die Berechnung des Ferienanspruchs und den Bezug der Ferien."]
[]
[null,"Pfarramtliche Aufgaben gemäss Art. 112 und 113 der Kirchenordnung werden in der Kirchgemeinde wahrgenommen. Über Ausnahmen entscheidet die Kirchenpflege. \nDer Pfarrkonvent organisiert die Aufgaben- und Verantwortungsbereiche in Bezug auf die einzelnen Pfarrstellen und Pfarrpersonen. Er berücksichtigt dabei insbesondere die durch die Kirchenpflege festgelegte strategische Ausrichtung der Kirchgemeinde sowie von der Kirchenpflege erteilte Kommissions- oder Teamaufträge"]
[]
[]
[null,"§ 115 \n1 In Kirchgemeinden mit einem Pfarrkonvent erarbeitet dieser innert sechs Monaten seit der letzten Wahl gemäss Art. 125 eine Pfarrdienstordnung und legt sie der Kirchenpflege zur Genehmigung vor.\n2 Die Pfarrdienstordnung bezweckt insbesondere, die Arbeit der Pfarrerinnen und Pfarrer unter Wahrung des Gesamtzusammenhanges der Gemeinde unter diesen aufzuteilen.\n"]
[]
[null,"§ 29 \n1 Die Landeskirche nimmt ihren Auftrag wahr durch die Verkündigung des Evangeliums in Wort und Tat in den vier Handlungsfeldern Verkündigung und Gottesdienst, Diakonie und Seelsorge, Bildung und Spiritualität sowie Gemeindeaufbau und Leitung.\n"]
[]
[null,"§ 150 1 Die Kirchenpflege, die Pfarrerinnen und Pfarrer sowie die Angestellten sind in gemeinsamer Verantwortung zum Aufbau der Gemeinde gerufen.\n2 Die Kirchenpflege nimmt ihre Aufgaben im Rahmen der behördlichen Verantwortung gemäss Kirchenordnung und kantonalem Recht wahr.\n3 Die Pfarrerinnen und Pfarrer sowie die Angestellten erfüllen ihre Aufgaben je in ihrem besonderen Dienst gemäss der Kirchenordnung, den Vorgaben der Kirchenpflege und den besonderen Gegebenheiten der Kirchgemeinde.\n"]
[]
[]
[]
{"$rows_left_out":3}